{"text_format":"1","workbook":"xlsx","n_sheets":12,"sheets":["Cover","General data","Data entry (1)","Data entry (2)","Data entry (3)","Results (1)","Results (2)","Results (3)","Further resources","hide_backend","hide_Suchtabellen","hide_LI Database"],"not_rendered":{"charts":4,"images":35,"macros":1,"external_links":1,"defined_names":12,"comments":0,"pivot_tables":0},"unopened":[],"bounds":{"document_bytes":16777216,"sheet_cells":100000,"rows_first":2000,"rows_last":500,"rows_between":2000,"halvings":0,"cell_chars":16384,"cell_head_chars":4096},"cells_cut":0,"cells_raw":0,"read":"whole","date_system":"1900"}

{"sheet":"Cover","index":0,"n_rows":26,"n_cols":7,"rows_kept":26,"cut":false,"hidden":false,"merged":[[2,3,2,12],[3,3,3,12],[20,5,20,11],[22,5,22,11]]}
[]
[]
[null,null,null,"GIZ (Living) Income Gap Estimator"]
[null,null,null,"v1.0 (01.02.2022)"]
[]
[]
[null,null,"About this tool",null,"This tool allows calculating gaps between actual income and any given income reference"]
[null,null,null,null,"Considered are living income/wage benchmarks and various poverty lines"]
[]
[null,null,"Data requirements",null,"Guidance and/or calculation options are provided, depending on available data."]
{"$rows_left_out":17}
{"sheet":"General data","index":1,"n_rows":32,"n_cols":18,"rows_kept":32,"cut":false,"hidden":false,"merged":[[27,3,27,7],[9,8,9,9],[10,8,10,9],[11,8,11,9],[12,8,12,9],[16,8,16,9],[17,8,17,9]]}
[]
[null,null,null,null,null,null,null,null,null,null,null,null,null,null,null,null,null,"Kommentare"]
[null,null,"General information and specification of available data",null,null,null,null,null,null,null,null,null,null,null,null,null,null,"Ab hier wird später gelöscht"]
[null,null,null,null,null,null,null,null,null,null,null,null,null,null,null,null,null," \"very hidden\" werden in User Version"]
[null,null,null,null,null,null,null,null,null,null,null,null,null,null,null,null,null,"VBA Passwort schützen"]
[null,null,"Q1","Please provide information on the following key aspects",null,null,null,null,null,null,null,null,null,null,null,null,null,"Über VBA Worksheets ganz ausblenden \"VeryHidden\""]
[null,null,null,"A set of benchmarks will be generated based on your selection"]
[null,null,null,"Source of benchmarks: https://align-tool.com/"]
[]
[null,null,"a)","select country of interest",null,null,null,null,"Argentina"]
{"$rows_left_out":23}
{"sheet":"Data entry (1)","index":2,"n_rows":33,"n_cols":14,"rows_kept":33,"cut":false,"hidden":false,"merged":[[29,5,33,6],[19,2,21,4],[19,5,20,6],[23,5,25,6],[26,5,28,6],[32,2,32,4],[26,2,28,4],[23,2,25,4]]}
[]
[]
[null,null,"Data entry form"]
[null,null,"Net income of all income generating activities (main and all other)"]
[]
[]
[null,null,"Q1","Please provide information on the average (absolute) net income for all income generating activites"]
[null,null,null,"Note: consider total annual net income of all household members"]
[]
[]
{"$rows_left_out":24}
{"sheet":"Data entry (2)","index":3,"n_rows":46,"n_cols":16,"rows_kept":46,"cut":false,"hidden":false,"merged":[[45,2,45,3]]}
[]
[null,null,null,null,null,null,null,null,null,null,null,null,null,null,null,"delete from P to end"]
[null,null,"Data entry form"]
[null,null,"Net income of main product (e.g. crop) & of other income generating activities"]
[]
[]
[null,null,"Q1","Please provide information on the average (absolute) net income of the main cash product (e.g. crop)"]
[null,null,null,"Note: consider total annual net income"]
[]
[]
{"$rows_left_out":37}
{"sheet":"Data entry (3)","index":4,"n_rows":23,"n_cols":13,"rows_kept":23,"cut":false,"hidden":false,"merged":[]}
[]
[]
[null,null,"Data entry form"]
[null,null,"Net income of main product (e.g. crop) & income share of main product"]
[]
[]
[null,null,"Q1","Please provide information on the average (absolute) net income of the main cash product (e.g. crop)"]
[null,null,null,"Note: consider total annual net income generated through main product"]
[]
[]
{"$rows_left_out":14}
{"sheet":"Results (1)","index":5,"n_rows":35,"n_cols":19,"rows_kept":35,"cut":false,"hidden":false,"merged":[[17,18,17,20],[21,18,21,20],[25,18,25,20],[9,18,9,20],[29,18,29,20],[14,18,14,20],[18,18,18,20],[19,18,19,20],[22,18,22,20],[6,17,6,21],[10,18,10,20],[11,18,11,20],[13,18,13,20],[15,18,15,20],[23,18,23,20],[26,18,26,20],[27,18,27,20],[34,17,36,21],[34,2,36,15]]}
[]
[]
[null,null,"Results",null,"Net income of all income generating activities (main and all other)"]
[]
[]
[]
[null,null,null,null,null,null,null,null,null,null,null,null,null,null,null,null,null,"Benchmark Calculations"]
[null,null,null,null,null,null,null,null,null,null,"Av. Total Actual Income",null,{"$f":"hide_backend!F17","v":0},"USD","/HH /yr"]
[]
[null,null,null,null,null,null,null,null,null,null,"Living Income Benchmark",null,{"$f":"hide_backend!C6","v":{"$error":"#N/A"}},{"$f":"'General data'!$I$13","v":"Local Currency (LCU)"},"/HH /yr",null,null,null,"LI per person per month * household size * 12"]
{"$rows_left_out":26}
{"sheet":"Results (2)","index":6,"n_rows":36,"n_cols":19,"rows_kept":36,"cut":false,"hidden":false,"merged":[[35,3,37,15],[35,17,37,21],[21,18,21,20],[22,18,22,20],[23,18,23,20],[26,18,26,20],[27,18,27,20],[28,18,28,20],[30,18,30,20],[14,18,14,20],[15,18,15,20],[17,18,17,20],[18,18,18,20],[19,18,19,20],[6,17,6,21],[9,18,9,20],[10,18,10,20],[11,18,11,20],[13,18,13,20]]}
[]
[]
[null,null,"Results",null,"Net income of main product (e.g. crop) & of other income generating activities"]
[]
[]
[]
[null,null,null,null,null,null,null,null,null,null,null,null,null,null,null,null,null,"Benchmark Calculations"]
[null,null,null,null,null,null,null,null,null,null,"Av. Total Actual Income",null,{"$f":"hide_backend!I28","v":{"$error":"#DIV/0!"}},"USD","/HH /yr"]
[]
[null,null,null,null,null,null,null,null,null,null,"Living Income Benchmark",null,{"$f":"hide_backend!C6","v":{"$error":"#N/A"}},{"$f":"'General data'!$I$13","v":"Local Currency (LCU)"},"/HH /yr",null,null,null,"LI per person per month * household size * 12"]
{"$rows_left_out":27}
{"sheet":"Results (3)","index":7,"n_rows":35,"n_cols":19,"rows_kept":35,"cut":false,"hidden":false,"merged":[[6,18,6,20],[8,18,8,20],[9,18,9,20],[13,18,13,20],[17,18,17,20],[21,18,21,20],[29,18,29,20],[25,18,25,20],[10,18,10,20],[34,3,36,15],[34,17,36,21],[23,18,23,20],[26,18,26,20],[27,18,27,20],[11,18,11,20],[14,18,14,20],[15,18,15,20],[18,18,18,20],[19,18,19,20],[22,18,22,20]]}
[]
[]
[null,null,"Results",null,"Net income of main product (e.g. crop) & income share of main product"]
[]
[]
[]
[null,null,null,null,null,null,null,null,null,null,null,null,null,null,null,null,null,null,"Benchmark Calculations"]
[null,null,null,null,null,null,null,null,null,null,"Av. Total actual income",null,{"$f":"hide_backend!F39","v":{"$error":"#DIV/0!"}},"USD","/HH /yr"]
[]
[null,null,null,null,null,null,null,null,null,null,"Living Income Benchmark",null,{"$f":"hide_backend!C6","v":{"$error":"#N/A"}},{"$f":"'General data'!$I$13","v":"Local Currency (LCU)"},"/HH /yr",null,null,null,"LI per person per month * household size * 12"]
{"$rows_left_out":26}
{"sheet":"Further resources","index":8,"n_rows":44,"n_cols":4,"rows_kept":44,"cut":false,"hidden":false,"merged":[[22,2,23,11],[26,2,28,11],[30,2,31,11],[33,2,34,11],[41,2,42,11],[37,2,38,11]]}
[]
[]
[null,null,"Further resources that you may find useful"]
[]
[]
[null,null,"Websites "]
[null,null,"For link, click on image"]
[]
[]
[]
{"$rows_left_out":35}
{"sheet":"hide_backend","index":9,"n_rows":40,"n_cols":14,"rows_kept":40,"cut":false,"hidden":false,"merged":[]}
[]
[null,"Benchmark Look-up drinnen"]
[null,"Mal 12 (um Jahr rauszukriegen)"]
[null,"Summary table",null,null,null,"S1_all info available",null,null,"S2_main & distribution",null,null,"S3_main and main share"]
[null,"Benchmarks","Value","Unit currency","Unit per X","Income gap","share","Gap?","Income gap","share","Gap?","Income gap",null,"Gap?"]
[null,"Living Income",{"$f":"INDEX('hide_LI Database'!BL7:BN62,MATCH('General data'!I10:J10&'General data'!I11:J11,'hide_LI Database'!A7:A62&'hide_LI Database'!B7:B62,0),MATCH('General data'!F18,'hide_LI Database'!BL6:BN6,0))*12","v":{"$error":"#N/A"}},{"$f":"'General data'!$I$13","v":"Local Currency (LCU)"},"/HH /yr",{"$f":"IF(C6=0,\"No benchmark\",C6-$F$17)","v":{"$error":"#N/A"}},{"$f":"IF(F6=\"No benchmark\",\"n.a.\",F6/C6*100)","v":{"$error":"#N/A"}},{"$f":"IF(F6<0,\"no income gap\",F6)","v":{"$error":"#N/A"}},{"$f":"IF(C6=0,\"No benchmark\",C6-$I$28)","v":{"$error":"#N/A"}},{"$f":"IF(I6=\"No benchmark\",\"n.a.\",I6/C6*100)","v":{"$error":"#N/A"}},{"$f":"IF(I6<0,\"no income gap\",I6)","v":{"$error":"#N/A"}},{"$f":"IF(C6=0,\"No benchmark\",C6-$F$39)","v":{"$error":"#N/A"}},{"$f":"IF(L6=\"No benchmark\",\"n.a.\",L6/C6*100)","v":{"$error":"#N/A"}},{"$f":"IF(L6<0,\"no income gap\",L6)","v":{"$error":"#N/A"}}]
[null,"Living Wage",{"$f":"INDEX('hide_LI Database'!BB7:BD62,MATCH('General data'!I10:J10&'General data'!I11:J11,'hide_LI Database'!A7:A62&'hide_LI Database'!B7:B62,0),MATCH('General data'!F18,'hide_LI Database'!BB6:BD6,0))*12","v":{"$error":"#N/A"}},{"$f":"'General data'!$I$13","v":"Local Currency (LCU)"},"/HH /yr",{"$error":"#N/A"},{"$error":"#N/A"},{"$f":"IF(F7<0,\"no income gap\",F7)","v":{"$error":"#N/A"}},{"$error":"#N/A"},{"$error":"#N/A"},{"$f":"IF(I7<0,\"no income gap\",I7)","v":{"$error":"#N/A"}},{"$error":"#N/A"},{"$error":"#N/A"},{"$f":"IF(L7<0,\"no income gap\",L7)","v":{"$error":"#N/A"}}]
[null,"National minimum wage",{"$f":"INDEX('hide_LI Database'!AR7:AT62,MATCH('General data'!I10:J10&'General data'!I11:J11,'hide_LI Database'!A7:A62&'hide_LI Database'!B7:B62,0),MATCH('General data'!F18,'hide_LI Database'!AR6:AT6,0))*12","v":{"$error":"#N/A"}},{"$f":"'General data'!$I$13","v":"Local Currency (LCU)"},"/HH /yr",{"$error":"#N/A"},{"$error":"#N/A"},{"$error":"#N/A"},{"$error":"#N/A"},{"$error":"#N/A"},{"$error":"#N/A"},{"$error":"#N/A"},{"$error":"#N/A"},{"$error":"#N/A"}]
[null,"National poverty line",{"$f":"INDEX('hide_LI Database'!AH7:AJ62,MATCH('General data'!I10:J10&'General data'!I11:J11,'hide_LI Database'!A7:A62&'hide_LI Database'!B7:B62,0),MATCH('General data'!F18,'hide_LI Database'!AH6:AJ6,0))*12","v":{"$error":"#N/A"}},{"$f":"'General data'!$I$13","v":"Local Currency (LCU)"},"/HH /yr",{"$error":"#N/A"},{"$error":"#N/A"},{"$error":"#N/A"},{"$error":"#N/A"},{"$error":"#N/A"},{"$error":"#N/A"},{"$error":"#N/A"},{"$error":"#N/A"},{"$error":"#N/A"}]
[null,"World Bank poverty line",{"$f":"INDEX('hide_LI Database'!S7:U62,MATCH('General data'!I10:J10&'General data'!I11:J11,'hide_LI Database'!A7:A62&'hide_LI Database'!B7:B62,0),MATCH('General data'!F18,'hide_LI Database'!S6:U6,0))*12","v":{"$error":"#N/A"}},{"$f":"'General data'!$I$13","v":"Local Currency (LCU)"},"/HH /yr",{"$error":"#N/A"},{"$error":"#N/A"},{"$error":"#N/A"},{"$error":"#N/A"},{"$error":"#N/A"},{"$error":"#N/A"},{"$error":"#N/A"},{"$error":"#N/A"},{"$error":"#N/A"}]
{"$rows_left_out":31}
{"sheet":"hide_Suchtabellen","index":10,"n_rows":41,"n_cols":48,"rows_kept":41,"cut":false,"hidden":false,"merged":[]}
[]
["Countries",null,"Region",null,"Commodity ",null,"Currency ",null,null,"Argentina","Bangladesh","Brazil","Burkina Faso","Cameroon","Chile","China","Colombia","Costa Rica","Cote d'Ivoire","Dominican Republic","Ecuador","Egypt, Arab Rep.","El Salvador","Ethiopia","Ghana","Guatemala","Honduras","India","Kenya","Madagascar","Malawi","Mexico","Morocco","Mozambique","Nicaragua","Nigeria","Pakistan","Panama","Papua New Guinea","Peru","Rwanda","South Africa","Sri Lanka","Tanzania","Tunisia","Turkey","Uganda","Vietnam"]
["Argentina",null,"Urban",null,"Banana",null,"EUR",null,null,"Urban","Urban Satellite Cities","Urban","Rural","Rural","Non-Metropolitan Urban","Urban Zhengzhou","Urban-Rural","Rural","Rural","Rural","Rural","Rural","Rural","Non-Metropolitan Urban","Peri-Urban","Rural","Rural","Urban","Rural","Rural","Rural","Non-metropolitan Urban & Rural","Rural","Rural","Urban","Rural","Rural","Rural","Rural","Rural","Rural","Rural","Rural","Rural","Rural","Rural","Rural","Rural"]
["Bangladesh",null,"Rural",null,"Cocao",null,"Local Currency (LCU)",null,null,"Rural","Urban Dhaka City","Non-metropolitan",null,null,null,"Urban Chengdu",null,null,"Rural Cocoa growing areas",null,null,null,null,null,"Rural",null,null,"Rural Bhadohi, Uttar Pradesh","Non-metropolitan Urban",null,null,null,null,null,"Rural-Urban",null,"Urban",null,null,null,null,null,null,"Urban",null,null,null,"Urban"]
["Brazil",null,"Non-metropolitan",null,"Coffee",null,"USD",null,null,null,null,null,null,null,null,"Urban Hangzhou",null,null,null,null,null,null,null,null,null,null,null,"Rural Rural Nilgiris, Tamil Nadu"]
["Burkina Faso",null,"Non-Metropolitan Urban",null,"Orange",null,null,null,null,null,null,null,null,null,null,"Urban Shanghai"]
["Cameroon",null,"Urban-Rural",null,"Palmoil",null,null,null,null,null,null,null,null,null,null,"Urban Shenzhen"]
["Chile",null,"Peri-Urban",null,"Soy",null,null,null,null,null,null,null,null,null,null,"Urban Suzhou"]
["China",null,"Non-metropolitan Urban & Rural",null,"Vanila"]
["Colombia",null,"Rural-Urban",null,"Other"]
{"$rows_left_out":32}
{"sheet":"hide_LI Database","index":11,"n_rows":62,"n_cols":70,"rows_kept":62,"cut":false,"hidden":false,"merged":[[4,68,5,68],[4,69,5,69],[4,53,4,56],[4,57,4,58],[4,59,4,62],[4,63,4,66],[4,67,5,67],[4,37,4,38],[4,39,4,42],[4,43,4,46],[4,47,4,48],[4,49,4,52],[2,37,2,46],[2,47,2,56],[2,57,2,66],[2,67,2,69],[3,37,3,46],[3,47,3,56],[3,57,3,66],[3,67,3,69],[4,29,4,32],[4,33,4,36],[4,10,4,13],[4,14,4,17],[4,18,4,21],[4,22,4,23],[4,25,4,28],[2,7,2,21],[2,22,2,36],[3,7,3,21],[3,22,3,36],[3,0,3,2],[3,3,3,6],[0,0,0,2],[0,3,1,6],[1,0,1,2],[2,0,2,2],[2,3,2,6]]}
["Living Wage & Living Income Dataset",null,null,"ALIGN (www.align-tool.com) provides an overview of the available living wage and income studies based on the internationally acknowledged Anker methodology."]
["Data valid on April 2021"]
["Geography\nSource: GLWC & LICoP",null,null,"Family composition\nSource: GLWC & LICoP",null,null,null,"International Poverty Lines\nSource: World Bank",null,null,null,null,null,null,null,null,null,null,null,null,null,null,"National Poverty Lines",null,null,null,null,null,null,null,null,null,null,null,null,null,null,"Minimum Wages\nSource: ILO & WageIndicator Foundation",null,null,null,null,null,null,null,null,null,"Living Wages\nSource: Global Living Wage Coalition",null,null,null,null,null,null,null,null,null,"Living Income\nSource: GLWC & LICoP",null,null,null,null,null,null,null,null,null,"Currency "]
["LW / LI are based on the cost of living in a specific geography, at country or sub-country level, and differ per rural, urban or peri-urban areas",null,null,"The family composition parameters, such as family size, adults per family and labour force are taken from the LW/LI studies.",null,null,null,"The International Poverty Lines are retrieved from the World Bank and differ per country according to the World Bank classification by income group. They are based on a division into 4 income groupings: low-income Int. Poverty Line, set at $1.90/day; lower-middle income Int. Poverty Line, set at $3.20/day; upper-middle income Int. Poverty Line, set at $5.50/day; and high-income Int. Poverty Line, set at $21.70/day. Information on family size and labour force from the LW/LI studies was taken into account.",null,null,null,null,null,null,null,null,null,null,null,null,null,null,"The National Poverty Lines are retrieved from official governmental sources that differ per country. The information on family size and labour force from the LW/LI studies was taken into account.",null,null,null,null,null,null,null,null,null,null,null,null,null,null,"The data refer to national minimum wage rates where they exist. For countries with multiple minimum wage rates, the selected rate has been specified. Data reported as hourly, weekly, and yearly are converted to monthly, using a 45-hour standard work week, with a maximum of 8hours per day. The information on family size and labour force from the LW/LI studies was taken into account.",null,null,null,null,null,null,null,null,null,"The information is from the Global Living Wage Coalition, from living wage studies that use the full Anker Methodology and Anker Reference Values. The Global Living Wage Coalition's data on family size and labour force were taken into account.",null,null,null,null,null,null,null,null,null,"Information from LW/LI studies that use the full Anker Methodology and Anker Reference Values. In the lack of a living income study, cost of living data was taken from living wage studies to provide living income estimates. The information on family size and labour force from the LW/LI studies was taken into account.",null,null,null,null,null,null,null,null,null,"Currency conversion rates to LCU, EUR & USD are from InforEuro, January 2021. International dollars were calculated using the World Bank PPP conversion factor for 2019."]
["Country","Locality","Region/area","Study type","Family size","Adults per family","Labour force","Year","Poverty headcount ratio","Int. poverty line\nPer person/day","Int. poverty line\nPer person/month",null,null,null,"Int. poverty line\nPer workforce/month",null,null,null,"Int. poverty line \nPer family/month",null,null,null,null,null,"National poverty line\nPer person/day","National poverty line\nPer person/month",null,null,null,"National poverty line\nPer workforce/month",null,null,null,"National poverty line\nPer family/month",null,null,null,null,null,"Minimum Wage \nPer workforce/month",null,null,null,"Minimum Wage\nPer family/month",null,null,null,null,null,"Living Wage \nPer workforce/month",null,null,null,"Living Wage\nPer family/month",null,null,null,null,null,"Living Income\nPer person/month",null,null,null,"Living Income\nPer family/month",null,null,null,"Local currency unit (LCU)","Currency code","2019 PPP Conversion factor"]
[null,null,null,null,"#people","#adults","Workforce/ family",null,"% of population","USD","USD","EUR","LCU","2019 PPP$","USD","EUR","LCU","2019 PPP$","USD","EUR","LCU","2019 PPP$","Year","Source","LCU","LCU","USD","EUR","2019 PPP$","LCU","USD","EUR","2019 PPP$","LCU","USD","EUR","2019 PPP$","Year, type","Source","LCU","USD","EUR","2019 PPP$","LCU","USD","EUR","2019 PPP$","Year","Source","LCU","USD","EUR","2019 PPP$","LCU","USD","EUR","2019 PPP$","Year","Source","LCU","USD","EUR","2019 PPP$","LCU","USD","EUR","2019 PPP$"]
["Argentina","Urban",null,"Living Wage Reference Value",4,2,1.66,2019,14,5.5,{"$f":"J7*30.4","v":167.2},136,13923,null,{"$f":"S7/G7","v":402.89156626506025},{"$f":"T7/G7","v":327.71084337349401},{"$f":"U7/G7","v":33549.397590361448},null,{"$f":"K7*E7","v":668.8},{"$f":"L7*E7","v":544},{"$f":"M7*E7","v":55692},null,null,null,null,null,null,null,null,null,null,null,null,null,null,null,null,2021,"Wage Indicator",21600,259,211,null,{"$f":"AN7*G7","v":35856},430,350,null,2020,"GLWC",38741,465,378,null,{"$f":"AX7*G7","v":64310.06},{"$f":"AY7*G7","v":771.9},{"$f":"AZ7*G7","v":627.48},null,2020,"Calculated from GLWC",{"$f":"(36376*G7)/E7","v":15096.039999999999},181,147,null,{"$f":"BH7*E7","v":60384.159999999996},{"$f":"BI7*E7","v":724},{"$f":"BJ7*E7","v":588},null,"Argentine peso","ARS"]
["Argentina","Rural",null,"Living Income Reference Value",4,2,null,2019,14,5.5,167.2,136,13923,null,null,null,null,null,{"$f":"K8*E8","v":668.8},544,55692,null,null,null,null,null,null,null,null,null,null,null,null,null,null,null,null,2021,"Wage Indicator",21600,259,211,null,null,null,null,null,null,null,null,null,null,null,null,null,null,null,2020,"GLWC",{"$f":"BL8/E8","v":12505.75},{"$f":"BM8/E8","v":150},{"$f":"BN8/E8","v":122.25},null,50023,600,489,null,"Argentine peso","ARS"]
["Bangladesh","Urban","Satellite Cities and Districts Surrounding Dhaka","Living Wage Benchmark",4,2,1.58,2016,52,3.2,97.28,79,8226,{"$f":"M9/BR9","v":260.84157849514719},{"$f":"S9/G9","v":246.27848101265823},{"$f":"T9/G9","v":200},{"$f":"U9/G9","v":20825.3164556962},{"$f":"Q9/BR9","v":660.35842656999284},389.12,316,32904,{"$f":"U9/BR9","v":1043.3663139805888},"2016, Low poverty line","Bangladesh Bureau of Statistics (BBS)",{"$f":"Z9/30.4","v":61.25},1862,{"$f":"AI9/E9","v":22},{"$f":"AJ9/E9","v":18},{"$f":"Z9/BR9","v":59.042915044731842},{"$f":"(Y9*30.4*E9)/G9","v":4713.9240506329115},56,46,{"$f":"AD9/BR9","v":149.47573429046037},{"$f":"Y9*30.4*E9","v":7448},88,72,{"$f":"AH9/BR9","v":236.17166017892737},2013,"Wage Indicator",1500,18,14,{"$f":"AN9/BR9","v":47.564109864177098},{"$f":"AN9*G9","v":2370},{"$f":"AO9*G9","v":28.44},{"$f":"AP9*G9","v":22.12},{"$f":"AR9/BR9","v":75.151293585399813},2016,"GLWC",13630,161,131,{"$f":"AX9/BR9","v":432.19921163248927},{"$f":"AX9*G9","v":21535.4},{"$f":"AY9*G9","v":254.38000000000002},{"$f":"AZ9*G9","v":206.98000000000002},{"$f":"BB9/BR9","v":682.87475437933301},2016,"Calculated from GLWC",5135.5,60.5,49.25,{"$f":"BH9/BR9","v":162.84365747165432},20542,242,197,{"$f":"BL9/BR9","v":651.3746298866173},"Bangladeshi taka","BDT",31.536383300000001]
["Bangladesh","Urban","Dhaka City","Living Wage Benchmark",4,2,1.58,2016,52,3.2,97.28,79,8226,260.84157849514719,246.27848101265823,200,20825.3164556962,660.35842656999284,389.12,316,32904,1043.3663139805888,"2016, Low poverty line","Bangladesh Bureau of Statistics (BBS)",{"$f":"Z10/30.4","v":61.25},1862,22,18,59.042915044731842,4713.9240506329115,56,46,149.47573429046037,7448,88,72,236.17166017892737,2013,"Wage Indicator",1500,18,14,47.564109864177098,2370,28.44,22.12,75.151293585399813,2016,"GLWC",16460,194,158,{"$f":"AX10/BR10","v":521.93683224290339},{"$f":"AX10*G10","v":26006.800000000003},{"$f":"AY10*G10","v":306.52000000000004},{"$f":"AZ10*G10","v":249.64000000000001},{"$f":"BB10/BR10","v":824.66019494378747},2016,"Calculated from GLWC",6202.25,73.25,59.5,196.66966693672828,24809,293,238,786.67866774691311,"Bangladeshi taka","BDT",31.536383300000001]
{"$rows_left_out":52}